Reaction Details
TargetAcetyl-CoA carboxylase 1
LigandBDBM50247094
Substrate/Competitorn/a
Meas. Tech.ChEMBL_1677382 (CHEMBL4027525)
IC50 14±n/a nM
Citation Mizojiri, RAsano, MTomita, DBanno, HNii, NSasaki, MSumi, HSatoh, YYamamoto, YMoriya, TSatomi, YMaezaki, H Discovery of Novel Selective Acetyl-CoA Carboxylase (ACC) 1 Inhibitors. J Med Chem61:1098-1117 (2018) 
 
Acetyl-CoA carboxylase 1
Name:Acetyl-CoA carboxylase 1
Type:Protein
Mol. Mass.:265543.22
Organism:Homo sapiens (Human)
Description:Q13085
Residue:2346
BDBM50247094
NameBDBM50247094
Synonyms:CHEMBL4101119
TypeSmall organic molecule
Emp. Form.C26H25N3O3S
Mol. Mass.459.56
SMILESCC(NC(C)=O)c1ccc2sc(nc2c1)-c1ccc(Oc2cccc(OCC3CC3)c2)nc1