Reaction Details
TargetAcetyl-CoA carboxylase 1
LigandBDBM50247130
Substrate/Competitorn/a
Meas. Tech.ChEMBL_1677382 (CHEMBL4027525)
IC50 6.4±n/a nM
Citation Mizojiri, RAsano, MTomita, DBanno, HNii, NSasaki, MSumi, HSatoh, YYamamoto, YMoriya, TSatomi, YMaezaki, H Discovery of Novel Selective Acetyl-CoA Carboxylase (ACC) 1 Inhibitors. J Med Chem61:1098-1117 (2018) 
 
Acetyl-CoA carboxylase 1
Name:Acetyl-CoA carboxylase 1
Type:Protein
Mol. Mass.:265543.22
Organism:Homo sapiens (Human)
Description:Q13085
Residue:2346
BDBM50247130
NameBDBM50247130
Synonyms:CHEMBL4073202
TypeSmall organic molecule
Emp. Form.C23H25N3O5
Mol. Mass.423.4617
SMILESC[C@@H](COc1cnc(o1)-c1ccc(Oc2cccc(OCC3CC3)c2)cc1)NC(N)=O