Reaction Details
TargetAcetyl-CoA carboxylase 1
LigandBDBM50247153
Substrate/Competitorn/a
Meas. Tech.ChEMBL_1677380 (CHEMBL4027523)
IC50 7.1±n/a nM
Citation Mizojiri, RAsano, MTomita, DBanno, HNii, NSasaki, MSumi, HSatoh, YYamamoto, YMoriya, TSatomi, YMaezaki, H Discovery of Novel Selective Acetyl-CoA Carboxylase (ACC) 1 Inhibitors. J Med Chem61:1098-1117 (2018) 
 
Acetyl-CoA carboxylase 1
Name:Acetyl-CoA carboxylase 1
Type:Protein
Mol. Mass.:265543.22
Organism:Homo sapiens (Human)
Description:Q13085
Residue:2346
BDBM50247153
NameBDBM50247153
Synonyms:CHEMBL4082153
TypeSmall organic molecule
Emp. Form.C26H25N3O4
Mol. Mass.443.4944
SMILESCC(NC(C)=O)c1ccc2nc(oc2c1)-c1ccc(Oc2cccc(OCC3CC3)c2)cn1