Reaction Details
TargetAcetylcholinesterase
LigandBDBM50004668
Substrate/Competitorn/a
Meas. Tech.ChEBML_28294
IC50 270±n/a nM
Citation Valli, MJTang, YKosh, JWChapman, JMSowell, JW Synthesis and cholinergic properties of N-aryl-2-[[[5-[(dimethylamino)methyl]-2-furanyl]methyl]thio]ethylamino analogs of ranitidine. J Med Chem35:3141-7 (1992) Acetylcholinesterase
Name:Acetylcholinesterase
Type:Enzyme
Mol. Mass.:67792.70
Organism:Homo sapiens (Human)
Description:P22303
Residue:614
BDBM50004668
NameBDBM50004668
Synonyms:CHEMBL327135 | [2-(5-Dimethylaminomethyl-furan-2-ylmethylsulfanyl)-ethyl]-[2,4-dinitro-5-(4-nitro-phenoxy)-phenyl]-amine
TypeSmall organic molecule
Emp. Form.C22H23N5O8S
Mol. Mass.517.512
SMILESCN(C)Cc1ccc(CSCCNc2cc(Oc3ccc(cc3)[N+]([O-])=O)c(cc2[N+]([O-])=O)[N+]([O-])=O)o1