Reaction Details
TargetAcetylcholinesterase
LigandBDBM50004672
Substrate/Competitorn/a
Meas. Tech.ChEBML_28294
IC50 650±n/a nM
Citation Valli, MJTang, YKosh, JWChapman, JMSowell, JW Synthesis and cholinergic properties of N-aryl-2-[[[5-[(dimethylamino)methyl]-2-furanyl]methyl]thio]ethylamino analogs of ranitidine. J Med Chem35:3141-7 (1992) Acetylcholinesterase
Name:Acetylcholinesterase
Type:Enzyme
Mol. Mass.:67792.70
Organism:Homo sapiens (Human)
Description:P22303
Residue:614
BDBM50004672
NameBDBM50004672
Synonyms:CHEMBL104334 | N-[2-(5-Dimethylaminomethyl-furan-2-ylmethylsulfanyl)-ethyl]-4,6-dinitro-N'-(3-nitro-pyridin-2-yl)-benzene-1,3-diamine
TypeSmall organic molecule
Emp. Form.C21H23N7O7S
Mol. Mass.517.515
SMILESCN(C)Cc1ccc(CSCCNc2cc(Nc3ncccc3[N+]([O-])=O)c(cc2[N+]([O-])=O)[N+]([O-])=O)o1