Reaction Details
TargetAcetylcholinesterase
LigandBDBM50004666
Substrate/Competitorn/a
Meas. Tech.ChEBML_28294
IC50 440.0±n/a nM
Citation Valli, MJTang, YKosh, JWChapman, JMSowell, JW Synthesis and cholinergic properties of N-aryl-2-[[[5-[(dimethylamino)methyl]-2-furanyl]methyl]thio]ethylamino analogs of ranitidine. J Med Chem35:3141-7 (1992) Acetylcholinesterase
Name:Acetylcholinesterase
Type:Enzyme
Mol. Mass.:67792.70
Organism:Homo sapiens (Human)
Description:P22303
Residue:614
BDBM50004666
NameBDBM50004666
Synonyms:CHEMBL106932 | [2-(5-Dimethylaminomethyl-furan-2-ylmethylsulfanyl)-ethyl]-[5-(N'-isopropylidene-hydrazino)-2,4-dinitro-phenyl]-amine
TypeSmall organic molecule
Emp. Form.C19H26N6O5S
Mol. Mass.450.512
SMILESC[C-](C)\N=[NH+]\c1cc(NCCSCc2ccc(CN(C)C)o2)c(cc1[N+]([O-])=O)[N+]([O-])=O