Reaction Details
TargetAcetylcholinesterase
LigandBDBM50004669
Substrate/Competitorn/a
Meas. Tech.ChEBML_28294
IC50 260±n/a nM
Citation Valli, MJTang, YKosh, JWChapman, JMSowell, JW Synthesis and cholinergic properties of N-aryl-2-[[[5-[(dimethylamino)methyl]-2-furanyl]methyl]thio]ethylamino analogs of ranitidine. J Med Chem35:3141-7 (1992) Acetylcholinesterase
Name:Acetylcholinesterase
Type:Enzyme
Mol. Mass.:67792.70
Organism:Homo sapiens (Human)
Description:P22303
Residue:614
BDBM50004669
NameBDBM50004669
Synonyms:CHEMBL106782 | N-[2-(5-Dimethylaminomethyl-furan-2-ylmethylsulfanyl)-ethyl]-4,6-dinitro-N'-propyl-benzene-1,3-diamine
TypeSmall organic molecule
Emp. Form.C19H27N5O5S
Mol. Mass.437.513
SMILESCCCNc1cc(NCCSCc2ccc(CN(C)C)o2)c(cc1[N+]([O-])=O)[N+]([O-])=O