Reaction Details
TargetMuscarinic acetylcholine receptor M2
LigandBDBM50004660
Substrate/Competitorn/a
Meas. Tech.ChEMBL_140041 (CHEMBL744021)
IC50 400±n/a nM
Citation Valli, MJTang, YKosh, JWChapman, JMSowell, JW Synthesis and cholinergic properties of N-aryl-2-[[[5-[(dimethylamino)methyl]-2-furanyl]methyl]thio]ethylamino analogs of ranitidine. J Med Chem35:3141-7 (1992) Muscarinic acetylcholine receptor M2
Name:Muscarinic acetylcholine receptor M2
Type:Enzyme Catalytic Domain
Mol. Mass.:51555.53
Organism:RAT
Description:P10980
Residue:466
BDBM50004660
NameBDBM50004660
Synonyms:CHEMBL107673 | N-[2-(5-Dimethylaminomethyl-furan-2-ylmethylsulfanyl)-ethyl]-4,6-dinitro-N'-pyridin-3-ylmethyl-benzene-1,3-diamine
TypeSmall organic molecule
Emp. Form.C22H26N6O5S
Mol. Mass.486.544
SMILESCN(C)Cc1ccc(CSCCNc2cc(NCc3cccnc3)c(cc2[N+]([O-])=O)[N+]([O-])=O)o1