Reaction Details
TargetPolyunsaturated fatty acid 5-lipoxygenase
LigandBDBM17638
Substrate/Competitorn/a
Meas. Tech.ChEBML_4163
IC50>25000±n/a nM
Citation Wright, SWHarris, RRCollins, RJCorbett, RLGreen, AMWadman, EABatt, DG Novel 1-(pyridylphenyl)-1-phenyl-2-imidazolylethanols with topical antiinflammatory activity. J Med Chem35:3148-55 (1992) Polyunsaturated fatty acid 5-lipoxygenase
Name:Polyunsaturated fatty acid 5-lipoxygenase
Type:PROTEIN
Mol. Mass.:78082.31
Organism:Rattus norvegicus
Description:ChEMBL_1432947
Residue:673
BDBM17638
NameBDBM17638
Synonyms:2-{1-[(4-chlorophenyl)carbonyl]-5-methoxy-2-methyl-1H-indol-3-yl}acetic acid Indocin US11478464, Compound Indomethacin US9271961, Indomethacin | indometacin
TypeSmall organic molecule
Emp. Form.C19H16ClNO4
Mol. Mass.357.788
SMILESCOc1ccc2n(C(=O)c3ccc(Cl)cc3)c(C)c(CC(O)=O)c2c1