Reaction Details
TargetProtein arginine N-methyltransferase 3
LigandBDBM50247380
Substrate/Competitorn/a
Meas. Tech.ChEMBL_1677669 (CHEMBL4027812)
IC50 19±n/a nM
Citation Kaniskan, HÜEram, MSZhao, KSzewczyk, MMYang, XSchmidt, KLuo, XXiao, SDai, MHe, FZang, ILin, YLi, FDobrovetsky, ESmil, DMin, SJLin-Jones, JSchapira, MAtadja, PLi, EBarsyte-Lovejoy, DArrowsmith, CHBrown, PJLiu, FYu, ZVedadi, MJin, J Discovery of Potent and Selective Allosteric Inhibitors of Protein Arginine Methyltransferase 3 (PRMT3). J Med Chem61:1204-1217 (2018) 
 
Protein arginine N-methyltransferase 3
Name:Protein arginine N-methyltransferase 3
Type:PROTEIN
Mol. Mass.:59886.87
Organism:Homo sapiens
Description:ChEMBL_101368
Residue:531
BDBM50247380
NameBDBM50247380
Synonyms:CHEMBL4061429
TypeSmall organic molecule
Emp. Form.C16H17ClN4O2
Mol. Mass.332.785
SMILESClc1cc(NC(=O)NCC(=O)N2CCCC2)cc2ccncc12