Reaction Details
TargetRibonucleoside-diphosphate reductase large subunit
LigandBDBM50247426
Substrate/Competitorn/a
Meas. Tech.ChEMBL_1677693 (CHEMBL4027836)
IC50 21140±n/a nM
Citation Huff, SEMohammed, FAYang, MAgrawal, PPink, JHarris, MEDealwis, CGViswanathan, R Structure-Guided Synthesis and Mechanistic Studies Reveal Sweetspots on Naphthyl Salicyl Hydrazone Scaffold as Non-Nucleosidic Competitive, Reversible Inhibitors of Human Ribonucleotide Reductase. J Med Chem61:666-680 (2018) 
 
Ribonucleoside-diphosphate reductase large subunit
Name:Ribonucleoside-diphosphate reductase large subunit
Type:PROTEIN
Mol. Mass.:90074.67
Organism:Homo sapiens (Human)
Description:ChEMBL_90946
Residue:792
BDBM50247426
NameBDBM50247426
Synonyms:CHEMBL4097201
TypeSmall organic molecule
Emp. Form.C16H13N3O3
Mol. Mass.295.2927
SMILESOc1ccc2[nH]cc(\C=N\NC(=O)c3ccccc3O)c2c1