Reaction Details
TargetRibonucleoside-diphosphate reductase large subunit
LigandBDBM50247440
Substrate/Competitorn/a
Meas. Tech.ChEMBL_1677693 (CHEMBL4027836)
IC50 20700±n/a nM
Citation Huff, SEMohammed, FAYang, MAgrawal, PPink, JHarris, MEDealwis, CGViswanathan, R Structure-Guided Synthesis and Mechanistic Studies Reveal Sweetspots on Naphthyl Salicyl Hydrazone Scaffold as Non-Nucleosidic Competitive, Reversible Inhibitors of Human Ribonucleotide Reductase. J Med Chem61:666-680 (2018) 
 
Ribonucleoside-diphosphate reductase large subunit
Name:Ribonucleoside-diphosphate reductase large subunit
Type:PROTEIN
Mol. Mass.:90074.67
Organism:Homo sapiens (Human)
Description:ChEMBL_90946
Residue:792
BDBM50247440
NameBDBM50247440
Synonyms:CHEMBL4091609
TypeSmall organic molecule
Emp. Form.C16H12N4O4
Mol. Mass.324.2909
SMILESOc1ccccc1C(=O)N\N=C\c1c[nH]c2ccc(cc12)[N+]([O-])=O