Reaction Details
TargetMuscarinic acetylcholine receptor
LigandBDBM50004656
Substrate/Competitorn/a
Meas. Tech.ChEBML_138302
Kd 18200±n/a nM
Citation Nilsson, BMVargas, HMHacksell, U Urea and 2-imidazolidone derivatives of the muscarinic agents oxotremorine and N-methyl-N-(1-methyl-4-pyrrolidino-2-butynyl)acetamide. J Med Chem35:3270-9 (1992) Muscarinic acetylcholine receptor
Name:Muscarinic acetylcholine receptor
Type:n/a
Mol. Mass.:66272.13
Organism:Cavia porcellus
Description:n/a
Residue:587
BDBM50004656
NameBDBM50004656
Synonyms:(2-Carbamoyloxy-ethyl)-trimethyl-ammonium (2-Hydroxyethyl)trimethyl ammonium chloride carbamate (carbachol)(2-Carbamoyloxy-ethyl)-trimethyl-ammonium 2-((Aminocarbonyl)oxy)-N,N,N-trimethylethanaminum chloride 2-(carbamoyloxy)-N,N,N-trimethylethanaminium chloride CARBASTAT Carbachol chloride Choline carbamate chloride Choline chlorine carbamate Karbamoylcholin chlorid | MIOSTAT
TypeSmall organic molecule
Emp. Form.C6H15N2O2
Mol. Mass.147.195
SMILESC[N+](C)(C)CCOC(N)=O