Reaction Details
TargetBeta-lactamase TEM
LigandBDBM50247459
Substrate/Competitorn/a
Meas. Tech.ChEMBL_1677806 (CHEMBL4027949)
IC50 32800±n/a nM
Citation Cain, RBrem, JZollman, DMcDonough, MAJohnson, RMSpencer, JMakena, AAbboud, MICahill, SLee, SYMcHugh, PJSchofield, CJFishwick, CWG In Silico Fragment-Based Design Identifies Subfamily B1 Metallo-?-lactamase Inhibitors. J Med Chem61:1255-1260 (2018) 
 
Beta-lactamase TEM
Name:Beta-lactamase TEM
Type:Enzyme
Mol. Mass.:31512.33
Organism:Escherichia coli
Description:P62593
Residue:286
BDBM50247459
NameBDBM50247459
Synonyms:CHEMBL4065946
TypeSmall organic molecule
Emp. Form.C14H11FO2S
Mol. Mass.262.299
SMILESOC(=O)c1ccc(cc1CS)-c1ccc(F)cc1