Reaction Details
TargetBeta-lactamase TEM
LigandBDBM50247467
Substrate/Competitorn/a
Meas. Tech.ChEMBL_1677806 (CHEMBL4027949)
IC50 5500±n/a nM
Citation Cain, RBrem, JZollman, DMcDonough, MAJohnson, RMSpencer, JMakena, AAbboud, MICahill, SLee, SYMcHugh, PJSchofield, CJFishwick, CWG In Silico Fragment-Based Design Identifies Subfamily B1 Metallo-?-lactamase Inhibitors. J Med Chem61:1255-1260 (2018) 
 
Beta-lactamase TEM
Name:Beta-lactamase TEM
Type:Enzyme
Mol. Mass.:31512.33
Organism:Escherichia coli
Description:P62593
Residue:286
BDBM50247467
NameBDBM50247467
Synonyms:CHEMBL4083640
TypeSmall organic molecule
Emp. Form.C14H10Cl2O2S
Mol. Mass.313.199
SMILESOC(=O)c1ccc(cc1CS)-c1cccc(Cl)c1Cl