Reaction Details
TargetBeta-lactamase OXA-10
LigandBDBM50247467
Substrate/Competitorn/a
Meas. Tech.ChEMBL_1677807 (CHEMBL4027950)
IC50 37300±n/a nM
Citation Cain, RBrem, JZollman, DMcDonough, MAJohnson, RMSpencer, JMakena, AAbboud, MICahill, SLee, SYMcHugh, PJSchofield, CJFishwick, CWG In Silico Fragment-Based Design Identifies Subfamily B1 Metallo-?-lactamase Inhibitors. J Med Chem61:1255-1260 (2018) 
 
Beta-lactamase OXA-10
Name:Beta-lactamase OXA-10
Type:PROTEIN
Mol. Mass.:29508.45
Organism:Pseudomonas aeruginosa
Description:ChEMBL_571868
Residue:266
BDBM50247467
NameBDBM50247467
Synonyms:CHEMBL4083640
TypeSmall organic molecule
Emp. Form.C14H10Cl2O2S
Mol. Mass.313.199
SMILESOC(=O)c1ccc(cc1CS)-c1cccc(Cl)c1Cl