Reaction Details
TargetcGMP-dependent 3',5'-cyclic phosphodiesterase
LigandBDBM9049
Substrate/Competitorn/a
Meas. Tech.ChEMBL_1677872 (CHEMBL4028015)
IC50 1.6±n/a nM
Citation Helal, CJArnold, EBoyden, TChang, CChappie, TAFisher, EHajos, MHarms, JFHoffman, WEHumphrey, JMPandit, JKang, ZKleiman, RJKormos, BLLee, CWLu, JMaklad, NMcDowell, LMcGinnis, DO'Connor, REO'Donnell, CJOgden, APiotrowski, MSchmidt, CJSeymour, PAUeno, HVansell, NVerhoest, PRYang, EX Identification of a Potent, Highly Selective, and Brain Penetrant Phosphodiesterase 2A Inhibitor Clinical Candidate. J Med Chem61:1001-1018 (2018) 
 
cGMP-dependent 3',5'-cyclic phosphodiesterase
Name:cGMP-dependent 3',5'-cyclic phosphodiesterase
Type:Enzyme Catalytic Domain
Mol. Mass.:105691.58
Organism:Homo sapiens (Human)
Description:O00408
Residue:941
BDBM9049
NameBDBM9049
Synonyms:US11419874, Example 15 US8829010, 55
Typen/a
Emp. Form.C20H18F3N7
Mol. Mass.413.399
SMILESCn1ncc(-c2nn(C)c3ncnc(N4CCC4)c23)c1-c1ccc(cc1)C(F)(F)F