Reaction Details
TargetcGMP-dependent 3',5'-cyclic phosphodiesterase
LigandBDBM50247534
Substrate/Competitorn/a
Meas. Tech.ChEMBL_1677872 (CHEMBL4028015)
IC50 11±n/a nM
Citation Helal, CJArnold, EBoyden, TChang, CChappie, TAFisher, EHajos, MHarms, JFHoffman, WEHumphrey, JMPandit, JKang, ZKleiman, RJKormos, BLLee, CWLu, JMaklad, NMcDowell, LMcGinnis, DO'Connor, REO'Donnell, CJOgden, APiotrowski, MSchmidt, CJSeymour, PAUeno, HVansell, NVerhoest, PRYang, EX Identification of a Potent, Highly Selective, and Brain Penetrant Phosphodiesterase 2A Inhibitor Clinical Candidate. J Med Chem61:1001-1018 (2018) 
 
cGMP-dependent 3',5'-cyclic phosphodiesterase
Name:cGMP-dependent 3',5'-cyclic phosphodiesterase
Type:Enzyme Catalytic Domain
Mol. Mass.:105691.58
Organism:Homo sapiens (Human)
Description:O00408
Residue:941
BDBM50247534
NameBDBM50247534
Synonyms:CHEMBL4081035
TypeSmall organic molecule
Emp. Form.C16H13F3N8
Mol. Mass.374.3232
SMILESCc1nc(-c2cnn(C)c2-c2ccc(cn2)C(F)(F)F)c2c(N)ncnn12