Reaction Details
TargetMineralocorticoid receptor
LigandBDBM50247541
Substrate/Competitorn/a
Meas. Tech.ChEMBL_1677998 (CHEMBL4028141)
IC50 13±n/a nM
Citation Piotrowski, DWFutatsugi, KCasimiro-Garcia, AWei, LSammons, MFHerr, MJiao, WLavergne, SYCoffey, SBWright, SWSong, KLoria, PMBanker, MEPetersen, DNBauman, J Identification of Morpholino-2H-pyrido[3,2-b][1,4]oxazin-3(4H)-ones as Nonsteroidal Mineralocorticoid Antagonists. J Med Chem61:1086-1097 (2018) 
 
Mineralocorticoid receptor
Name:Mineralocorticoid receptor
Type:Enzyme
Mol. Mass.:107076.42
Organism:Homo sapiens (Human)
Description:P08235
Residue:984
BDBM50247541
NameBDBM50247541
Synonyms:CHEMBL4086109
TypeSmall organic molecule
Emp. Form.C18H18FN3O3
Mol. Mass.343.3522
SMILESC[C@@H]1CN([C@@H](CO1)c1ccccc1F)c1ccc2OCC(=O)Nc2n1