Reaction Details
TargetPolyamine deacetylase HDAC10
LigandBDBM50247556
Substrate/Competitorn/a
Meas. Tech.ChEMBL_1678056 (CHEMBL4028199)
IC50 9791±n/a nM
Citation Lee, HYNepali, KHuang, FIChang, CYLai, MJLi, YHHuang, HLYang, CRLiou, JP (N-Hydroxycarbonylbenylamino)quinolines as Selective Histone Deacetylase 6 Inhibitors Suppress Growth of Multiple Myeloma in Vitro and in Vivo. J Med Chem61:905-917 (2018) 
 
Polyamine deacetylase HDAC10
Name:Polyamine deacetylase HDAC10
Type:Chromatin regulator; hydrolase; repressor
Mol. Mass.:71431.89
Organism:Homo sapiens (Human)
Description:Q969S8
Residue:669
BDBM50247556
NameBDBM50247556
Synonyms:CHEMBL4104117
TypeSmall organic molecule
Emp. Form.C17H15N3O2
Mol. Mass.293.3199
SMILESONC(=O)c1ccc(CNc2cccc3cccnc23)cc1