Reaction Details
TargetHistone deacetylase 8
LigandBDBM50247556
Substrate/Competitorn/a
Meas. Tech.ChEMBL_1678054 (CHEMBL4028197)
IC50 1190±n/a nM
Citation Lee, HYNepali, KHuang, FIChang, CYLai, MJLi, YHHuang, HLYang, CRLiou, JP (N-Hydroxycarbonylbenylamino)quinolines as Selective Histone Deacetylase 6 Inhibitors Suppress Growth of Multiple Myeloma in Vitro and in Vivo. J Med Chem61:905-917 (2018) 
 
Histone deacetylase 8
Name:Histone deacetylase 8
Type:Enzyme
Mol. Mass.:41749.60
Organism:Homo sapiens (Human)
Description:Q9BY41
Residue:377
BDBM50247556
NameBDBM50247556
Synonyms:CHEMBL4104117
TypeSmall organic molecule
Emp. Form.C17H15N3O2
Mol. Mass.293.3199
SMILESONC(=O)c1ccc(CNc2cccc3cccnc23)cc1