Reaction Details
TargetHistone deacetylase 6
LigandBDBM50247569
Substrate/Competitorn/a
Meas. Tech.ChEMBL_1678047 (CHEMBL4028190)
IC50 25±n/a nM
Citation Lee, HYNepali, KHuang, FIChang, CYLai, MJLi, YHHuang, HLYang, CRLiou, JP (N-Hydroxycarbonylbenylamino)quinolines as Selective Histone Deacetylase 6 Inhibitors Suppress Growth of Multiple Myeloma in Vitro and in Vivo. J Med Chem61:905-917 (2018) 
 
Histone deacetylase 6
Name:Histone deacetylase 6
Type:Chromatin regulator; hydrolase; repressor
Mol. Mass.:131381.51
Organism:Homo sapiens (Human)
Description:Q9UBN7
Residue:1215
BDBM50247569
NameBDBM50247569
Synonyms:CHEMBL4069121
TypeSmall organic molecule
Emp. Form.C19H17N3O2
Mol. Mass.319.3572
SMILESONC(=O)\C=C\c1ccc(CNc2cccc3ncccc23)cc1