Reaction Details
TargetHistone deacetylase 4
LigandBDBM50247556
Substrate/Competitorn/a
Meas. Tech.ChEMBL_1678051 (CHEMBL4028194)
IC50 4438±n/a nM
Citation Lee, HYNepali, KHuang, FIChang, CYLai, MJLi, YHHuang, HLYang, CRLiou, JP (N-Hydroxycarbonylbenylamino)quinolines as Selective Histone Deacetylase 6 Inhibitors Suppress Growth of Multiple Myeloma in Vitro and in Vivo. J Med Chem61:905-917 (2018) 
 
Histone deacetylase 4
Name:Histone deacetylase 4
Type:Enzyme
Mol. Mass.:119049.39
Organism:Homo sapiens (Human)
Description:P56524
Residue:1084
BDBM50247556
NameBDBM50247556
Synonyms:CHEMBL4104117
TypeSmall organic molecule
Emp. Form.C17H15N3O2
Mol. Mass.293.3199
SMILESONC(=O)c1ccc(CNc2cccc3cccnc23)cc1