Reaction Details
TargetC-X-C chemokine receptor type 4
LigandBDBM50247609
Substrate/Competitorn/a
Meas. Tech.ChEMBL_1678192 (CHEMBL4028335)
IC50 47±n/a nM
Citation Wu, CHSong, JSKuan, HHWu, SHChou, MCJan, JJTsou, LKKe, YYChen, CTYeh, KCWang, SYYeh, TKTseng, CTHuang, CLWu, MHKuo, PCLee, CJShia, KS Development of Stem-Cell-Mobilizing Agents Targeting CXCR4 Receptor for Peripheral Blood Stem Cell Transplantation and Beyond. J Med Chem61:818-833 (2018) 
 
C-X-C chemokine receptor type 4
Name:C-X-C chemokine receptor type 4
Type:Enzyme
Mol. Mass.:39754.61
Organism:Homo sapiens (Human)
Description:P61073
Residue:352
BDBM50247609
NameBDBM50247609
Synonyms:CHEMBL4091201
TypeSmall organic molecule
Emp. Form.C26H46N10
Mol. Mass.498.7104
SMILESCCc1cc(NC2CCNCC2)nc(NCc2cn(CCCNCCCNC3CCCCC3)nn2)n1