Reaction Details
TargetC-X-C chemokine receptor type 4
LigandBDBM50247610
Substrate/Competitorn/a
Meas. Tech.ChEMBL_1678192 (CHEMBL4028335)
IC50 34±n/a nM
Citation Wu, CHSong, JSKuan, HHWu, SHChou, MCJan, JJTsou, LKKe, YYChen, CTYeh, KCWang, SYYeh, TKTseng, CTHuang, CLWu, MHKuo, PCLee, CJShia, KS Development of Stem-Cell-Mobilizing Agents Targeting CXCR4 Receptor for Peripheral Blood Stem Cell Transplantation and Beyond. J Med Chem61:818-833 (2018) 
 
C-X-C chemokine receptor type 4
Name:C-X-C chemokine receptor type 4
Type:Enzyme
Mol. Mass.:39754.61
Organism:Homo sapiens (Human)
Description:P61073
Residue:352
BDBM50247610
NameBDBM50247610
Synonyms:CHEMBL4070263
TypeSmall organic molecule
Emp. Form.C24H42N10
Mol. Mass.470.6573
SMILESC(CNCCCn1cc(CNc2nccc(NC3CCNCC3)n2)nn1)CNC1CCCCC1