Reaction Details
TargetC-X-C chemokine receptor type 4
LigandBDBM50247621
Substrate/Competitorn/a
Meas. Tech.ChEMBL_1678192 (CHEMBL4028335)
IC50 48±n/a nM
Citation Wu, CHSong, JSKuan, HHWu, SHChou, MCJan, JJTsou, LKKe, YYChen, CTYeh, KCWang, SYYeh, TKTseng, CTHuang, CLWu, MHKuo, PCLee, CJShia, KS Development of Stem-Cell-Mobilizing Agents Targeting CXCR4 Receptor for Peripheral Blood Stem Cell Transplantation and Beyond. J Med Chem61:818-833 (2018) 
 
C-X-C chemokine receptor type 4
Name:C-X-C chemokine receptor type 4
Type:Enzyme
Mol. Mass.:39754.61
Organism:Homo sapiens (Human)
Description:P61073
Residue:352
BDBM50247621
NameBDBM50247621
Synonyms:CHEMBL4078499
TypeSmall organic molecule
Emp. Form.C28H50N10
Mol. Mass.526.7636
SMILESCCCN1CCC(CC1)Nc1cc(C)nc(NCc2cn(CCCNCCCNC3CCCCC3)nn2)n1