Reaction Details
TargetNicotinamide N-methyltransferase
LigandBDBM50247634
Substrate/Competitorn/a
Meas. Tech.ChEMBL_1678255 (CHEMBL4028398)
IC50 14000±n/a nM
Citation Babault, NAllali-Hassani, ALi, FFan, JYue, AJu, KLiu, FVedadi, MLiu, JJin, J Discovery of Bisubstrate Inhibitors of Nicotinamide N-Methyltransferase (NNMT). J Med Chem61:1541-1551 (2018) 
 
Nicotinamide N-methyltransferase
Name:Nicotinamide N-methyltransferase
Type:Protein
Mol. Mass.:29571.16
Organism:Homo sapiens (Human)
Description:n/a
Residue:264
BDBM50247634
NameBDBM50247634
Synonyms:CHEMBL4067973
TypeSmall organic molecule
Emp. Form.C24H32N8O6
Mol. Mass.528.5609
SMILESN[C@@H](CCCN(CCc1cccc(c1)C(N)=O)C[C@H]1O[C@H]([C@H](O)[C@@H]1O)n1cnc2c(N)ncnc12)C(O)=O