Reaction Details
TargetKynurenine 3-monooxygenase
LigandBDBM50061907
Substrate/Competitorn/a
Meas. Tech.ChEMBL_1678463 (CHEMBL4028606)
IC50 900±n/a nM
Citation Pellicciari, RLiscio, PGiacchè, NDe Franco, FCarotti, ARobertson, JCialabrini, LKatsyuba, ERaffaelli, NAuwerx, J ?-Amino-?-carboxymuconate-?-semialdehyde Decarboxylase (ACMSD) Inhibitors as Novel Modulators of De Novo Nicotinamide Adenine Dinucleotide (NAD J Med Chem61:745-759 (2018) 
 
Kynurenine 3-monooxygenase
Name:Kynurenine 3-monooxygenase
Type:PROTEIN
Mol. Mass.:54371.88
Organism:Rattus norvegicus
Description:ChEMBL_1487468
Residue:478
BDBM50061907
NameBDBM50061907
Synonyms:(+/-)-2-Amino-4-(3-nitro-phenyl)-4-oxo-butyric acid[(+/-)-m-nicotinylbenzoylalanine] CHEMBL23983 | meta-nitrobenzoyl)alanine
TypeSmall organic molecule
Emp. Form.C10H10N2O5
Mol. Mass.238.1968
SMILESNC(CC(=O)c1cccc(c1)[N+]([O-])=O)C(O)=O