Reaction Details
TargetATP-binding cassette sub-family C member 2
LigandBDBM6644
Substrate/Competitorn/a
Meas. Tech.ChEMBL_1678645 (CHEMBL4028922)
IC50>133000±n/a nM
Citation Morgan, REvan Staden, CJChen, YKalyanaraman, NKalanzi, JDunn, RTAfshari, CAHamadeh, HK A multifactorial approach to hepatobiliary transporter assessment enables improved therapeutic compound development. Toxicol Sci136:216-41 (2013) 
 
ATP-binding cassette sub-family C member 2
Name:ATP-binding cassette sub-family C member 2
Type:Protein
Mol. Mass.:174229.45
Organism:Homo sapiens (Human)
Description:Q92887
Residue:1545
BDBM6644
NameBDBM6644
Synonyms:6‐phenylpteridine‐2,4,7‐triamine (5) Pteridine deriv. 11 | TRIAMTERENE
TypeSmall organic molecule
Emp. Form.C12H11N7
Mol. Mass.253.2626
SMILESNc1nc(N)c2nc(c(N)nc2n1)-c1ccccc1