Reaction Details
TargetATP-binding cassette sub-family C member 3
LigandBDBM50186231
Substrate/Competitorn/a
Meas. Tech.ChEMBL_1678646 (CHEMBL4028923)
IC50 95900±n/a nM
Citation Morgan, REvan Staden, CJChen, YKalyanaraman, NKalanzi, JDunn, RTAfshari, CAHamadeh, HK A multifactorial approach to hepatobiliary transporter assessment enables improved therapeutic compound development. Toxicol Sci136:216-41 (2013) 
 
ATP-binding cassette sub-family C member 3
Name:ATP-binding cassette sub-family C member 3
Type:PROTEIN
Mol. Mass.:169352.45
Organism:Homo sapiens (Human)
Description:ChEMBL_735421
Residue:1527
BDBM50186231
NameBDBM50186231
Synonyms:(2,3-Dichloro-4-(2-methylene-1-oxobutyl)phenoxy)acetic acid ETHACRYNIC ACID Etacrinic acid Hydromedin [2,3-dichloro-4-(2-methylidenebutanoyl)phenoxy]acetic acid | jm5b01461, Compound 72
TypeSmall organic molecule
Emp. Form.C13H12Cl2O4
Mol. Mass.303.138
SMILESCCC(=C)C(=O)c1ccc(OCC(O)=O)c(Cl)c1Cl