Reaction Details
TargetBile salt export pump
LigandBDBM50355610
Substrate/Competitorn/a
Meas. Tech.ChEMBL_1678644 (CHEMBL4028921)
IC50>133000±n/a nM
Citation Morgan, REvan Staden, CJChen, YKalyanaraman, NKalanzi, JDunn, RTAfshari, CAHamadeh, HK A multifactorial approach to hepatobiliary transporter assessment enables improved therapeutic compound development. Toxicol Sci136:216-41 (2013) 
 
Bile salt export pump
Name:Bile salt export pump
Type:Protein
Mol. Mass.:146405.49
Organism:Homo sapiens (Human)
Description:O95342
Residue:1321
BDBM50355610
NameBDBM50355610
Synonyms:CHEMBL1237108
TypeSmall organic molecule
Emp. Form.C20H30NO3
Mol. Mass.332.4566
SMILESCC(C)[N+]1(C)C2CCC1CC(C2)OC(=O)C(CO)c1ccccc1