Reaction Details
TargetATP-binding cassette sub-family C member 3
LigandBDBM81767
Substrate/Competitorn/a
Meas. Tech.ChEMBL_1678646 (CHEMBL4028923)
IC50>133000±n/a nM
Citation Morgan, REvan Staden, CJChen, YKalyanaraman, NKalanzi, JDunn, RTAfshari, CAHamadeh, HK A multifactorial approach to hepatobiliary transporter assessment enables improved therapeutic compound development. Toxicol Sci136:216-41 (2013) 
 
ATP-binding cassette sub-family C member 3
Name:ATP-binding cassette sub-family C member 3
Type:PROTEIN
Mol. Mass.:169352.45
Organism:Homo sapiens (Human)
Description:ChEMBL_735421
Residue:1527
BDBM81767
NameBDBM81767
Synonyms:15-28-Somatostatin-28 CB6417646 | Somatostatin-14
TypeSmall organic molecule
Emp. Form.C76H104N18O19S2
Mol. Mass.1637.878
SMILESC[C@@H](O)[C@@H]1NC(=O)[C@H](Cc2ccccc2)NC(=O)[C@@H](NC(=O)[C@H](CCCCN)NC(=O)[C@H](Cc2c[nH]c3ccccc23)NC(=O)[C@H](Cc2ccccc2)NC(=O)[C@H](Cc2ccccc2)NC(=O)[C@H](CC(N)=O)NC(=O)[C@H](CCCCN)NC(=O)[C@H](CSSC[C@H](NC(=O)[C@H](CO)NC1=O)C(O)=O)NC(=O)CNC(=O)[C@H](C)N)[C@@H](C)O