Reaction Details
TargetATP-binding cassette sub-family C member 2
LigandBDBM50355610
Substrate/Competitorn/a
Meas. Tech.ChEMBL_1678645 (CHEMBL4028922)
IC50>133000±n/a nM
Citation Morgan, REvan Staden, CJChen, YKalyanaraman, NKalanzi, JDunn, RTAfshari, CAHamadeh, HK A multifactorial approach to hepatobiliary transporter assessment enables improved therapeutic compound development. Toxicol Sci136:216-41 (2013) 
 
ATP-binding cassette sub-family C member 2
Name:ATP-binding cassette sub-family C member 2
Type:Protein
Mol. Mass.:174229.45
Organism:Homo sapiens (Human)
Description:Q92887
Residue:1545
BDBM50355610
NameBDBM50355610
Synonyms:CHEMBL1237108
TypeSmall organic molecule
Emp. Form.C20H30NO3
Mol. Mass.332.4566
SMILESCC(C)[N+]1(C)C2CCC1CC(C2)OC(=O)C(CO)c1ccccc1