Reaction Details
TargetATP-binding cassette sub-family C member 4
LigandBDBM50027536
Substrate/Competitorn/a
Meas. Tech.ChEMBL_1678647 (CHEMBL4028924)
IC50>133000±n/a nM
Citation Morgan, REvan Staden, CJChen, YKalyanaraman, NKalanzi, JDunn, RTAfshari, CAHamadeh, HK A multifactorial approach to hepatobiliary transporter assessment enables improved therapeutic compound development. Toxicol Sci136:216-41 (2013) 
 
ATP-binding cassette sub-family C member 4
Name:ATP-binding cassette sub-family C member 4
Type:PROTEIN
Mol. Mass.:149546.12
Organism:Homo sapiens (Human)
Description:ChEMBL_1486828
Residue:1325
BDBM50027536
NameBDBM50027536
Synonyms:(phosphonoformate)Trisodium phosphonoformate CHEMBL754 FOSCARNET SODIUM Foscavir trisodium dioxidophosphinecarboxylate oxide trisodium phosphonoformate
TypeSmall organic molecule
Emp. Form.CO5P
Mol. Mass.122.9831
SMILES[O-]C(=O)P([O-])([O-])=O