Reaction Details
TargetBile salt export pump
LigandBDBM50088383
Substrate/Competitorn/a
Meas. Tech.ChEMBL_1678644 (CHEMBL4028921)
IC50>133000±n/a nM
Citation Morgan, REvan Staden, CJChen, YKalyanaraman, NKalanzi, JDunn, RTAfshari, CAHamadeh, HK A multifactorial approach to hepatobiliary transporter assessment enables improved therapeutic compound development. Toxicol Sci136:216-41 (2013) 
 
Bile salt export pump
Name:Bile salt export pump
Type:Protein
Mol. Mass.:146405.49
Organism:Homo sapiens (Human)
Description:O95342
Residue:1321
BDBM50088383
NameBDBM50088383
Synonyms:Amlodipine Norvasc
TypeSmall organic molecule
Emp. Form.C20H25ClN2O5
Mol. Mass.408.876
SMILESCCOC(=O)C1=C(COCCN)NC(C)=C(C1c1ccccc1Cl)C(=O)OC