Reaction Details
TargetATP-binding cassette sub-family C member 2
LigandBDBM50049730
Substrate/Competitorn/a
Meas. Tech.ChEMBL_1678645 (CHEMBL4028922)
IC50 84400±n/a nM
Citation Morgan, REvan Staden, CJChen, YKalyanaraman, NKalanzi, JDunn, RTAfshari, CAHamadeh, HK A multifactorial approach to hepatobiliary transporter assessment enables improved therapeutic compound development. Toxicol Sci136:216-41 (2013) 
 
ATP-binding cassette sub-family C member 2
Name:ATP-binding cassette sub-family C member 2
Type:Protein
Mol. Mass.:174229.45
Organism:Homo sapiens (Human)
Description:Q92887
Residue:1545
BDBM50049730
NameBDBM50049730
Synonyms:2-(5-(2-methyl-3-phenylallylidene)-4-oxo-2-thioxothiazolidin-3-yl)acetic acid Epalrestat | {5-[(E)-2-Methyl-3-phenyl-prop-2-en-(Z)-ylidene]-4-oxo-2-thioxo-thiazolidin-3-yl}-acetic acid
TypeSmall organic molecule
Emp. Form.C15H13NO3S2
Mol. Mass.319.399
SMILESC\C(\C=C1/SC(=S)N(CC(O)=O)C1=O)=C/c1ccccc1