Reaction Details
TargetATP-binding cassette sub-family C member 2
LigandBDBM50320491
Substrate/Competitorn/a
Meas. Tech.ChEMBL_1678645 (CHEMBL4028922)
IC50>133000±n/a nM
Citation Morgan, REvan Staden, CJChen, YKalyanaraman, NKalanzi, JDunn, RTAfshari, CAHamadeh, HK A multifactorial approach to hepatobiliary transporter assessment enables improved therapeutic compound development. Toxicol Sci136:216-41 (2013) 
 
ATP-binding cassette sub-family C member 2
Name:ATP-binding cassette sub-family C member 2
Type:Protein
Mol. Mass.:174229.45
Organism:Homo sapiens (Human)
Description:Q92887
Residue:1545
BDBM50320491
NameBDBM50320491
Synonyms:2-(3-CYANO-4-ISOBUTOXY-PHENYL)-4-METHYL-5-THIAZOLE-CARBOXYLIC ACID FEBUXOSTAT | US11744839, Compound of formula 5
TypeSmall organic molecule
Emp. Form.C16H16N2O3S
Mol. Mass.316.375
SMILESCC(C)COc1ccc(cc1C#N)-c1nc(C)c(s1)C(O)=O