Reaction Details
TargetATP-binding cassette sub-family C member 3
LigandBDBM81790
Substrate/Competitorn/a
Meas. Tech.ChEMBL_1678646 (CHEMBL4028923)
IC50>133000±n/a nM
Citation Morgan, REvan Staden, CJChen, YKalyanaraman, NKalanzi, JDunn, RTAfshari, CAHamadeh, HK A multifactorial approach to hepatobiliary transporter assessment enables improved therapeutic compound development. Toxicol Sci136:216-41 (2013) 
 
ATP-binding cassette sub-family C member 3
Name:ATP-binding cassette sub-family C member 3
Type:PROTEIN
Mol. Mass.:169352.45
Organism:Homo sapiens (Human)
Description:ChEMBL_735421
Residue:1527
BDBM81790
NameBDBM81790
Synonyms:Amisulpride NSC_2159 US10259786, Amisulpride
TypeSmall organic molecule
Emp. Form.C17H27N3O4S
Mol. Mass.369.479
SMILESCCN1CCCC1CNC(=O)c1cc(c(N)cc1OC)S(=O)(=O)CC