Reaction Details
TargetATP-binding cassette sub-family C member 3
LigandBDBM50442892
Substrate/Competitorn/a
Meas. Tech.ChEMBL_1678646 (CHEMBL4028923)
IC50 2000±n/a nM
Citation Morgan, REvan Staden, CJChen, YKalyanaraman, NKalanzi, JDunn, RTAfshari, CAHamadeh, HK A multifactorial approach to hepatobiliary transporter assessment enables improved therapeutic compound development. Toxicol Sci136:216-41 (2013) 
 
ATP-binding cassette sub-family C member 3
Name:ATP-binding cassette sub-family C member 3
Type:PROTEIN
Mol. Mass.:169352.45
Organism:Homo sapiens (Human)
Description:ChEMBL_735421
Residue:1527
BDBM50442892
NameBDBM50442892
Synonyms:Benicar OLMESARTAN MEDOXOMIL
TypeSmall organic molecule
Emp. Form.C29H30N6O6
Mol. Mass.558.5851
SMILESCCCc1nc(c(C(=O)OCc2oc(=O)oc2C)n1Cc1ccc(cc1)-c1ccccc1-c1nnn[nH]1)C(C)(C)O