Reaction Details
TargetATP-binding cassette sub-family C member 3
LigandBDBM21613
Substrate/Competitorn/a
Meas. Tech.ChEMBL_1678646 (CHEMBL4028923)
IC50>133000±n/a nM
Citation Morgan, REvan Staden, CJChen, YKalyanaraman, NKalanzi, JDunn, RTAfshari, CAHamadeh, HK A multifactorial approach to hepatobiliary transporter assessment enables improved therapeutic compound development. Toxicol Sci136:216-41 (2013) 
 
ATP-binding cassette sub-family C member 3
Name:ATP-binding cassette sub-family C member 3
Type:PROTEIN
Mol. Mass.:169352.45
Organism:Homo sapiens (Human)
Description:ChEMBL_735421
Residue:1527
BDBM21613
NameBDBM21613
Synonyms:2-[(2E)-3-(3,4-dimethoxyphenyl)prop-2-enamido]benzoic acid Rizaben | Tranilast
TypeSmall organic molecule
Emp. Form.C18H17NO5
Mol. Mass.327.3313
SMILESCOc1ccc(\C=C\C(=O)Nc2ccccc2C(O)=O)cc1OC