Reaction Details
TargetATP-binding cassette sub-family C member 4
LigandBDBM50097346
Substrate/Competitorn/a
Meas. Tech.ChEMBL_1678647 (CHEMBL4028924)
IC50 3000±n/a nM
Citation Morgan, REvan Staden, CJChen, YKalyanaraman, NKalanzi, JDunn, RTAfshari, CAHamadeh, HK A multifactorial approach to hepatobiliary transporter assessment enables improved therapeutic compound development. Toxicol Sci136:216-41 (2013) 
 
ATP-binding cassette sub-family C member 4
Name:ATP-binding cassette sub-family C member 4
Type:PROTEIN
Mol. Mass.:149546.12
Organism:Homo sapiens (Human)
Description:ChEMBL_1486828
Residue:1325
BDBM50097346
NameBDBM50097346
Synonyms:(+/-)-2-(3-chloro-9H-carbazol-7-yl)propanoic acid 2-(6-Chloro-9H-carbazol-2-yl)-propionic acid(carprofen) CARPROFEN Rimadyl | Ro-20-5720/000
TypeSmall organic molecule
Emp. Form.C15H12ClNO2
Mol. Mass.273.714
SMILESCC(C(O)=O)c1ccc2c(c1)[nH]c1ccc(Cl)cc21