Reaction Details
TargetATP-binding cassette sub-family C member 3
LigandBDBM50041802
Substrate/Competitorn/a
Meas. Tech.ChEMBL_1678646 (CHEMBL4028923)
IC50>133000±n/a nM
Citation Morgan, REvan Staden, CJChen, YKalyanaraman, NKalanzi, JDunn, RTAfshari, CAHamadeh, HK A multifactorial approach to hepatobiliary transporter assessment enables improved therapeutic compound development. Toxicol Sci136:216-41 (2013) 
 
ATP-binding cassette sub-family C member 3
Name:ATP-binding cassette sub-family C member 3
Type:PROTEIN
Mol. Mass.:169352.45
Organism:Homo sapiens (Human)
Description:ChEMBL_735421
Residue:1527
BDBM50041802
NameBDBM50041802
Synonyms:1,8-dihydroxy-9(10H)-anthracenone 1,8-dihydroxyanthracen-9(10H)-one CHEMBL46469 anthralin dithranol
TypeSmall organic molecule
Emp. Form.C14H10O3
Mol. Mass.226.2274
SMILESOc1cccc2Cc3cccc(O)c3C(=O)c12