Reaction Details
TargetATP-binding cassette sub-family C member 4
LigandBDBM50070208
Substrate/Competitorn/a
Meas. Tech.ChEMBL_1678647 (CHEMBL4028924)
IC50>133000±n/a nM
Citation Morgan, REvan Staden, CJChen, YKalyanaraman, NKalanzi, JDunn, RTAfshari, CAHamadeh, HK A multifactorial approach to hepatobiliary transporter assessment enables improved therapeutic compound development. Toxicol Sci136:216-41 (2013) 
 
ATP-binding cassette sub-family C member 4
Name:ATP-binding cassette sub-family C member 4
Type:PROTEIN
Mol. Mass.:149546.12
Organism:Homo sapiens (Human)
Description:ChEMBL_1486828
Residue:1325
BDBM50070208
NameBDBM50070208
Synonyms:A-65006 CHEBI:6375 Prevacid Prevacid Delayed Release Prevacid iv
TypeSmall organic molecule
Emp. Form.C16H14F3N3O2S
Mol. Mass.369.361
SMILESCc1c(OCC(F)(F)F)ccnc1C[S+]([O-])c1nc2ccccc2[nH]1