Reaction Details
TargetBile salt export pump
LigandBDBM12578
Substrate/Competitorn/a
Meas. Tech.ChEMBL_1678644 (CHEMBL4028921)
IC50>133000±n/a nM
Citation Morgan, REvan Staden, CJChen, YKalyanaraman, NKalanzi, JDunn, RTAfshari, CAHamadeh, HK A multifactorial approach to hepatobiliary transporter assessment enables improved therapeutic compound development. Toxicol Sci136:216-41 (2013) 
 
Bile salt export pump
Name:Bile salt export pump
Type:Protein
Mol. Mass.:146405.49
Organism:Homo sapiens (Human)
Description:O95342
Residue:1321
BDBM12578
NameBDBM12578
Synonyms:2-(imidazol-1-yl)-1-hydroxyethylidene-1,1-bisphosphonic acid CGP-42446 JMC515594 Compound 55 US11279719, Example Zolendronic acid (ZOL) Zoledronate [1-hydroxy-2-(1H-imidazol-1-yl)-1-phosphonoethyl]phosphonic acid | zoledronic acid
TypeSmall organic molecule
Emp. Form.C5H10N2O7P2
Mol. Mass.272.0896
SMILESOC(Cn1ccnc1)(P(O)(O)=O)P(O)(O)=O