Reaction Details
TargetThromboxane A2 receptor
LigandBDBM50005097
Substrate/Competitorn/a
Meas. Tech.ChEBML_209761
IC50 4.4±n/a nM
Citation Fukumoto, SShiraishi, MTerashita, ZAshida, YInada, Y Synthesis and thromboxane A2/prostaglandin H2 receptor antagonistic activity of phenol derivatives. J Med Chem35:2202-9 (1992) Thromboxane A2 receptor
Name:Thromboxane A2 receptor
Type:Enyzme
Mol. Mass.:37445.28
Organism:Homo sapiens (Human)
Description:P21731
Residue:343
BDBM50005097
NameBDBM50005097
Synonyms:7-(4-Fluoro-phenyl)-7-(3-formyl-6-hydroxy-2,4,5-trimethyl-phenyl)-heptanoic acid | CHEMBL420002
TypeSmall organic molecule
Emp. Form.C23H27FO4
Mol. Mass.386.4565
SMILESCc1c(C)c(C=O)c(C)c(C(CCCCCC(O)=O)c2ccc(F)cc2)c1O