Reaction Details
TargetSphingosine 1-phosphate receptor 3
LigandBDBM50148418
Substrate/Competitorn/a
Meas. Tech.ChEMBL_1679176 (CHEMBL4029453)
IC50 2.7±n/a nM
Citation Dyckman, AJ Modulators of Sphingosine-1-phosphate Pathway Biology: Recent Advances of Sphingosine-1-phosphate Receptor 1 (S1P J Med Chem60:5267-5289 (2017) 
 
Sphingosine 1-phosphate receptor 3
Name:Sphingosine 1-phosphate receptor 3
Type:G Protein-Coupled Receptor (GPCR)
Mol. Mass.:42278.13
Organism:Homo sapiens (Human)
Description:Q99500
Residue:378
BDBM50148418
NameBDBM50148418
Synonyms:CHEMBL119256 | [3-(4-Octyl-benzylamino)-propyl]-phosphonic acid
TypeSmall organic molecule
Emp. Form.C18H32NO3P
Mol. Mass.341.4253
SMILESCCCCCCCCc1ccc(CNCCCP(O)(O)=O)cc1