Reaction Details
TargetSphingosine 1-phosphate receptor 3
LigandBDBM50248366
Substrate/Competitorn/a
Meas. Tech.ChEMBL_1679176 (CHEMBL4029453)
IC50 1200±n/a nM
Citation Dyckman, AJ Modulators of Sphingosine-1-phosphate Pathway Biology: Recent Advances of Sphingosine-1-phosphate Receptor 1 (S1P J Med Chem60:5267-5289 (2017) 
 
Sphingosine 1-phosphate receptor 3
Name:Sphingosine 1-phosphate receptor 3
Type:G Protein-Coupled Receptor (GPCR)
Mol. Mass.:42278.13
Organism:Homo sapiens (Human)
Description:Q99500
Residue:378
BDBM50248366
NameBDBM50248366
Synonyms:CHEMBL4072987
TypeSmall organic molecule
Emp. Form.C19H31NO2
Mol. Mass.305.4549
SMILESCCCCCCCCc1ccc(CNCCCC(O)=O)cc1