Reaction Details
TargetSphingosine 1-phosphate receptor 1
LigandBDBM50248417
Substrate/Competitorn/a
Meas. Tech.ChEMBL_1679186 (CHEMBL4029463)
EC50 16±n/a nM
Citation Dyckman, AJ Modulators of Sphingosine-1-phosphate Pathway Biology: Recent Advances of Sphingosine-1-phosphate Receptor 1 (S1P J Med Chem60:5267-5289 (2017) 
 
Sphingosine 1-phosphate receptor 1
Name:Sphingosine 1-phosphate receptor 1
Type:Enzyme
Mol. Mass.:42836.02
Organism:Homo sapiens (Human)
Description:P21453
Residue:382
BDBM50248417
NameBDBM50248417
Synonyms:CHEMBL4076418
TypeSmall organic molecule
Emp. Form.C21H21N5O2
Mol. Mass.375.4237
SMILESCCc1cc(-c2noc(n2)-c2cc(-c3ccccc3)n(CC)n2)c(C)[nH]c1=O