Reaction Details
TargetSphingosine 1-phosphate receptor 1
LigandBDBM50248420
Substrate/Competitorn/a
Meas. Tech.ChEMBL_1679175 (CHEMBL4029452)
IC50 0.100000±n/a nM
Citation Dyckman, AJ Modulators of Sphingosine-1-phosphate Pathway Biology: Recent Advances of Sphingosine-1-phosphate Receptor 1 (S1P J Med Chem60:5267-5289 (2017) 
 
Sphingosine 1-phosphate receptor 1
Name:Sphingosine 1-phosphate receptor 1
Type:Enzyme
Mol. Mass.:42836.02
Organism:Homo sapiens (Human)
Description:P21453
Residue:382
BDBM50248420
NameBDBM50248420
Synonyms:CHEMBL115713
TypeSmall organic molecule
Emp. Form.C19H34NO4P
Mol. Mass.371.4513
SMILESCCCCCCCCc1ccc(CC[C@@H](N)C[C@H](O)P(O)(O)=O)cc1