Reaction Details
TargetCyclin-C
LigandBDBM50248640
Substrate/Competitorn/a
Meas. Tech.ChEMBL_1679274 (CHEMBL4029551)
IC50 0.600000±n/a nM
Citation Ono, KBanno, HOkaniwa, MHirayama, TIwamura, NHikichi, YMurai, SHasegawa, MHasegawa, YYonemori, KHata, AAoyama, KCary, DR Design and synthesis of selective CDK8/19 dual inhibitors: Discovery of 4,5-dihydrothieno[3',4':3,4]benzo[1,2-d]isothiazole derivatives. Bioorg Med Chem25:2336-2350 (2017) 
 
Cyclin-C
Name:Cyclin-C
Type:PROTEIN
Mol. Mass.:33244.88
Organism:Homo sapiens (Human)
Description:ChEMBL_107900
Residue:283
BDBM50248640
NameBDBM50248640
Synonyms:CHEMBL4074204
TypeSmall organic molecule
Emp. Form.C15H12N4O2S2
Mol. Mass.344.411
SMILESNC(=O)c1sc(Oc2ccc(N)nc2)c-2c1CCc1cnsc-21